{"text_format":"1","workbook":"xlsx","n_sheets":5,"sheets":["Sheet6","Sheet1","sheet5","Sheet2","Sheet3"],"not_rendered":{"charts":0,"images":36,"macros":1,"external_links":0,"defined_names":5,"comments":0,"pivot_tables":0},"unopened":[],"bounds":{"document_bytes":16777216,"sheet_cells":100000,"rows_first":2000,"rows_last":500,"rows_between":2000,"halvings":0,"cell_chars":16384,"cell_head_chars":4096},"cells_cut":0,"cells_raw":0,"read":"whole","date_system":"1900"}

{"sheet":"Sheet6","index":0,"n_rows":0,"n_cols":0,"rows_kept":0,"cut":false,"hidden":false,"merged":[[0,0,49,18]]}

{"sheet":"Sheet1","index":1,"n_rows":5,"n_cols":12,"rows_kept":5,"cut":false,"hidden":false,"merged":[[26,0,35,21],[1,18,25,21],[1,0,25,2],[0,0,0,21],[11,3,25,17],[4,3,10,10],[4,11,10,17],[1,3,3,17]]}
[]
[null,null,null,"welcome"]
[]
[]
[null,null,null,"   ",null,null,null,null,null,null,null,"J"]

{"sheet":"sheet5","index":2,"n_rows":40,"n_cols":12,"rows_kept":40,"cut":false,"hidden":false,"merged":[[10,4,10,13],[8,4,9,13],[29,4,29,13],[30,4,31,13],[11,4,11,13],[20,4,21,13],[18,4,19,13],[0,3,0,14],[1,3,44,3],[44,4,44,14],[1,14,43,14],[1,4,7,13],[32,6,32,8],[32,9,32,11],[32,12,33,12],[32,13,33,13],[41,10,42,11],[41,12,42,13],[17,4,17,13],[16,4,16,13],[14,4,15,13],[13,4,13,13],[12,4,12,13]]}
[]
[]
[]
[]
[]
[]
[]
[]
[null,null,null,null,"SWAMI VIVEKANAND SARASWATI VIDYA MANDIR"]
[]
[null,null,null,null,"Sector-3, rajendra nagar, sahibabad, ghaziabad, (U.P.)"]
[null,null,null,null,"Ph.: (0120) 4132236, 4103538"]
[null,null,null,null,"E-mail : swamivsvm@gmail.com"]
[null,null,null,null,"Website : www.svsvm.org"]
[null,null,null,null,"PERFORMANCE PROFILE"]
[]
[null,null,null,null,"CONTINUOS AND COMPREHENSIVE EVALUATION"]
[null,null,null,null,"(Issued by School as per directives of Central Board of Secondary Education, Delhi)"]
[]
[]
[null,null,null,null,"                                                          STUDENT PROFILE"]
[]
[null,null,null,null,null,"Roll no.",9546]
[null,null,null,null,null,"Name",{"$f":"VLOOKUP(G23,itsme,3,FALSE)","v":"GARIMA"}]
[null,null,null,null,"                 ","Class",{"$f":"VLOOKUP(G23,itsme,2,FALSE)","v":"IX-E"}]
[null,null,null,null,null,"D.O.B.",{"$f":"VLOOKUP(G23,itsme,7,FALSE)","v":"17-11-02"}]
[null,null,null,null,null,"Mother's Name",{"$f":"VLOOKUP(G23,itsme,5,FALSE)","v":"Mrs. Neetu ojha"}]
[null,null,null,null,null,"Father's Name",{"$f":"VLOOKUP(G23,itsme,4,FALSE)","v":"MR. deepak gupta"}]
[null,null,null,null,null,"Telephone No.",{"$f":"VLOOKUP(G23,itsme,6,FALSE)","v":8287343939}]
[]
[null,null,null,null,"ACADEMIC PERFORMANCE"]
[]
[null,null,null,null,"S.No.","Subjects","TERM - I",null,null,"TERM - II"]
[null,null,null,null,null,null,"FA 1","FA 2","SA 1","FA 3","FA 4 ","SA2"]
[null,null,null,null,1,"ENGLISH",{"$f":"VLOOKUP(G23,mydata,4,FALSE)","v":"C1"},{"$f":"VLOOKUP(G23,mydata,6,FALSE)","v":"C1"},{"$f":"VLOOKUP(G23,mydata,8,FALSE)","v":"A2"},{"$f":"VLOOKUP(G23,mydata,10,FALSE)","v":"B1"},{"$f":"VLOOKUP(G23,mydata,12,FALSE)","v":"B2"},{"$f":"VLOOKUP(G23,mydata,14,FALSE)","v":"C2"}]
[null,null,null,null,2,"HINDI",{"$f":"VLOOKUP(G23,mydata,17,FALSE)","v":"B1"},{"$f":"VLOOKUP(G23,mydata,19,FALSE)","v":"C1"},{"$f":"VLOOKUP(G23,mydata,19,FALSE)","v":"C1"},{"$f":"VLOOKUP(G23,mydata,23,FALSE)","v":"A2"},{"$f":"VLOOKUP(G23,mydata,25,FALSE)","v":"B2"},{"$f":"VLOOKUP(G23,mydata,27,FALSE)","v":"C1"}]
[null,null,null,null,3,"MATHS",{"$f":"VLOOKUP(G23,mydata,30,FALSE)","v":"C1"},{"$f":"VLOOKUP(G23,mydata,32,FALSE)","v":"A2"},{"$f":"VLOOKUP(G23,mydata,34,FALSE)","v":"A2"},{"$f":"VLOOKUP(G23,mydata,36,FALSE)","v":"A2"},{"$f":"VLOOKUP(G23,mydata,38,FALSE)","v":"B2"},{"$f":"VLOOKUP(G23,mydata,40,FALSE)","v":"B2"}]
[null,null,null,null,4,"SOCIAL STUDIES",{"$f":"VLOOKUP(G23,mydata,43,FALSE)","v":"C1"},{"$f":"VLOOKUP(G23,mydata,45,FALSE)","v":"B1"},{"$f":"VLOOKUP(G23,mydata,47,FALSE)","v":"A2"},{"$f":"VLOOKUP(G23,mydata,49,FALSE)","v":"B1"},{"$f":"VLOOKUP(G23,mydata,51,FALSE)","v":"B1"},{"$f":"VLOOKUP(G23,mydata,53,FALSE)","v":"C2"}]
[null,null,null,null,5,"SCIENCE",{"$f":"VLOOKUP(G23,mydata,56,FALSE)","v":"B1"},{"$f":"VLOOKUP(G23,mydata,58,FALSE)","v":"A1"},{"$f":"VLOOKUP(G23,mydata,60,FALSE)","v":"D1"},{"$f":"VLOOKUP(G23,mydata,62,FALSE)","v":"C1"},{"$f":"VLOOKUP(G23,mydata,64,FALSE)","v":"A1"},{"$f":"VLOOKUP(G23,mydata,66,FALSE)","v":"A2"}]
[null,null,null,null,6,"COMPUTER",{"$f":"VLOOKUP(G23,mydata,69,FALSE)","v":"B1"},{"$f":"VLOOKUP(G23,mydata,71,FALSE)","v":"B1"},{"$f":"VLOOKUP(G23,mydata,73,FALSE)","v":"A2"},{"$f":"VLOOKUP(G23,mydata,75,FALSE)","v":"D1"},{"$f":"VLOOKUP(G23,mydata,77,FALSE)","v":"B1"},{"$f":"VLOOKUP(G23,mydata,79,FALSE)","v":"A1"}]

{"sheet":"Sheet2","index":3,"n_rows":62,"n_cols":7,"rows_kept":62,"cut":false,"hidden":false,"merged":[[0,0,5,17]]}
[" "]
[]
[]
[]
[]
[]
["SR. NO.","Class","NAME","FATHER'S NAME ","MOTHER'S NAME","CONTACT NUMBER","D.O.B."]
[9501,"IX-E","ESHA SHARMA","MR. Rajkumar sharma","Mrs. Hemlata",8826983942,"2002-11-06"]
[9502,"IX-E","POONAM","MR. suresh","Mrs. Savita",9540022160,"14-11-02"]
[9503,"IX-E","SHIVANI BHOWRA","MR. satender","Mrs. suman",8826700416,"19-05-02"]
[9504,"IX-E","SWATI","MR. Nitesh","Mrs. Veermala",9971659827,"14-11-03"]
[9505,"IX-E","KRITI","MR. D.K. Vishwakarma","Mrs. Ruchi",9818847815,"15-06-02"]
[9506,"IX-E","NEETU","MR. kallu","Mrs. Reetu",9810233765,"2002-03-06"]
[9507,"IX-E","SHREYA","MR. umesh singh","Mrs. Seema Singh",9990908455,"2003-06-11"]
[9508,"IX-E","HIMANSHI","MR. Vijendra singh negi","Mrs. Devki Negi",7838977491,"2002-02-02"]
[9510,"IX-E","TANIYA CHAUHAN","MR. Viren","Mrs. Vimla",9958416517,"2000-05-02"]
[9511,"IX-E","LOVELY","MR. ramzan ali","Mrs. Shariphan",9560356583,"2002-08-12"]
[9512,"IX-E","JAYA ","MR. sudhir K. mishra","Mrs. Ranjana",9213704475,"2002-11-02"]
[9513,"IX-E","BHAVNA","MR. naresh singh chauhan","Mrs. Sangeeta",921278242,"17-1-01"]
[9514,"IX-E","POOJA","MR. Narender","Mrs. Saroj",9312116818,"16-01-03"]
[9515,"IX-E","KRITIKA ","MR. sunil jain","Mrs. Poonam",9953402194,"15-06-03"]
[9516,"IX-E","NEERA","MR. mohan kumar","Mrs. Parag mittal",9810326695,"2003-04-04"]
[9517,"IX-E","PRAGYA","MR. surender bisht","Mrs. Sakshi",9818411166,"2003-03-03"]
[9518,"IX-E","SADAF","MR. Mohd. Asif","Mrs. Mussarat",9871871824,"14-09-02"]
[9519,"IX-E","DIVYA KHARAKWAL","MR. ram","Mrs. suman",9999285167,"2001-05-11"]
[9520,"IX-E","SIMRAN","MR. jasveer","Mrs. Reena",9818441575,"2001-12-12"]
[9521,"IX-E","RITIKA","MR. V.K. singh","Mrs. Nisha",9910949523,"2002-08-09"]
[9522,"IX-E","NITI ","MR. shyam","Mrs. Saleena",9910862260,"23-10-01"]
[9523,"IX-E","AMISHA","MR. vinod rawat","Mrs. Satakshi",8826231786,"2001-07-07"]
[9524,"IX-E","GOPIKA","MR. surender bisht","Mrs. Kiran bisht",9555490046,"18-04-02"]
[9525,"IX-E","MAHIMA","MR. Rajesh mishra","Mrs. Aradhana",9818022907,"18-09-01"]
[9526,"IX-E","RAGINI","MR. satish","Mrs. Santosh",9891639511,"25-08-01"]
[9527,"IX-E","SHRUTI","MR. Narendar kumar","Mrs. Neetu ojha",8010936990,"28-10-02"]
[9528,"IX-E","SHAMA","MR. Salim ","Mrs. Saira",9811136586,"21-07-02"]
[9529,"IX-E","KOMAL","MR. Mohan chandra pathak","Mrs. Kanchan pathak",9711035858,"13-09-02"]
[9530,"IX-E","KARTIKA","MR. Jagmohan sharma","Mrs. Susheela",8588851237,"14-11-02"]
[9531,"IX-E","RAFIYA","MR. Alim saifi","Mrs. sangeeta",9310101745,"2002-12-12"]
[9532,"IX-E","SHALINI","MR. vikram singh","Mrs. Seema",8800978241,"29-10-01"]
[9533,"IX-E","ANUSHKA","MR. Digamber singh negi","Mrs. Suman",9910499721,"24-05-03"]
[9534,"IX-E","RIYA CHAUDHARY","MR. Rajendra chaudhary","Mrs. Pinki",9926458211,"24-01-04"]
[9535,"IX-E","GAURI"," MR. Rohit chauhan","Mrs. Rinky",9899242842,"2002-12-11"]
[9536,"IX-E","ADITI","MR. sunil kumar","Mrs. Hema",9910792501,"17-09-00"]
[9537,"IX-E","CHANCHAL BHOWRA ","MR. Anil kumar","Mrs. Rekha",7838089975,"2002-07-02"]
[9538,"IX-E","SONAL","MR. veer","Mrs. Sareeta",9210306213,"2002-10-03"]
[9539,"IX-E","TANYA GUPTA","MR. deepak gupta","Mrs. Neelam gupta",7011482955,"15-03-02"]
[9540,"IX-E","AKANSHA","MR. deepak gupta","Mrs. Seema",9654565874,"27-10-00"]
[9541,"IX-E","KARISHMA","MR. rinku singh","Mrs. Rakeha Devi",8595237386,"18-04-03"]
[9542,"IX-E","ALFISHA","MR. rounak khan","Mrs. Rasheeda khan",7503346780,"2002-10-11"]
[9543,"IX-E","KHUSHI","MR. Kuldeep singh","Mrs. Shanti",9582104114,"19-10-02"]
[9544,"IX-E","ANKITA","MR. vikram singh","Mrs.  Saroj",8510818415,"24-04-03"]
[9545,"IX-E","KAREENA","MR. Balkishan","Mrs. Saroj",9891682203,"21-04-02"]
[9546,"IX-E","GARIMA","MR. deepak gupta","Mrs. Neetu ojha",8287343939,"17-11-02"]
[9547,"IX-E","JHALAK","MR. Titu","Mrs. Salita",8595343739,"19-12-02"]
[9548,"IX-E","ANJALI","MR. tushar","Mrs. Sonika",9818846795,"2002-01-05"]
[9549,"IX-E","NIDHI","MR. kamlesh","Mrs. Sonia",8312042681,"28-02-02"]
[9550,"IX-E","NAMRATA","MR. Chandrakant Pandey","Mrs. Kamla",9822553162,"2001-09-10"]
[9551,"IX-E","DIVYA TYAGI","MR. Pradeep tyagi","Mrs. Sunita tyagi",9971100446,"20-03-02"]
[9552,"IX-E","PARUL","MR. Rajbeer singh","Mrs. Birmla",9999646185,"2001-05-02"]
[9553,"IX-E","MUSKAN","MR. Akbar ","Mrs. Kalsum",8053828238,"24-09-03"]
[9554,"IX-E","SHRUTI","MR. Ramkishan","Mrs. Kanchan",9871389259,"16-10-01"]
[9556,"IX-E","TWINKLE","MR. Channu singh","Mrs. Asha devi",9924861234,"18-10-03"]
[9557,"IX-E","SAKSHI","Mr. Ajay kumar","Mrs. Reeta bharti",9643161762,"2002-03-06"]

{"sheet":"Sheet3","index":4,"n_rows":71,"n_cols":80,"rows_kept":71,"cut":false,"hidden":false,"merged":[[7,47,7,48],[7,49,7,50],[7,56,7,57],[1,2,4,18],[6,0,8,0],[6,1,8,1],[6,67,6,79],[6,15,6,27],[6,41,6,53],[6,54,6,66],[6,2,6,14],[7,4,7,5],[7,6,7,7],[7,8,7,9],[7,17,7,18],[7,19,7,20],[7,21,7,22],[7,25,7,26],[7,28,7,29],[7,75,7,76],[7,51,7,52],[7,54,7,55],[7,64,7,65],[7,67,7,68],[7,73,7,74],[7,58,7,59],[7,60,7,61],[7,62,7,63],[7,69,7,70],[7,71,7,72],[7,77,7,78],[7,43,7,44],[7,45,7,46],[7,27,8,27],[7,41,7,42],[7,2,7,3],[7,10,7,11],[7,12,7,13],[7,15,7,16],[7,23,7,24],[7,38,7,39],[7,32,7,33],[7,34,7,35],[7,36,7,37],[7,30,7,31]]}
[]
[null,null,"Gazette"]
[]
[]
[]
[]
[" sr no.","Student's name","ENGLISH",null,null,null,null,null,null,null,null,null,null,null,null,"HINDI",null,null,null,null,null,null,null,null,null,null,null,null,"MATHS",null,null,null,null,null,null,null,null,null,null,null,null,"SOCIAL STUDIES",null,null,null,null,null,null,null,null,null,null,null,null,"science",null,null,null,null,null,null,null,null,null,null,null,null,"computer"]
[null,null,"FA 1 ",null,"FA2",null,"SA 1",null,"FA3",null,"FA 4 ",null,"SA 2",null,null,"FA 1 ",null,"FA 2",null,"SA 1 ",null,"FA 3",null,"FA 4",null,"SA 2",null,"TOTAL MARKS","FA 1 ",null," FA 2 ",null,"SA 1",null,"FA 3",null,"FA 4",null,"SA 2 ",null,null,"FA 1 ",null,"FA 2 ",null,"SA 1",null,"FA 3",null,"FA 4",null,"SA 2",null,null,"FA 1",null,"FA 2",null,"SA 1",null,"FA 3",null,"FA 4",null,"SA 2",null,null,"FA 1",null,"FA 2",null,"SA 1",null,"FA 3",null,"FA 4",null,"SA 2"]
[null,null,"marks","grade","marks","grade","marks","grade","marks","grade","marks","grade","marks","grade","TOTAL MARKS","marks","grade","marks","grade","marks","grade","marks","grade","marks","grade","marks","grade",null,"marks","grade","marks","grade","marks",null,"marks",null,"marks","grade","marks","grade","TOTAL MARKS","marks","grade","marks","grade","marks","grade","marks","grade","marks","grade","marks","grade","TOTAL MARKS","marks","grade","marks","grade","marks","grade","marks","grade","marks","grade","marks","grade","TOTAL MARKS","marks","grade","marks","grade","marks","grade","marks","grade","marks","grade","marks","grade","TOTAL MARKS"]
[9501,"ESHA SHARMA",28,{"$f":"IF(C10>45,\"A1\",IF(C10>40,\"A2\",IF(C10>35,\"B1\",IF(C10>30,\"B2\",IF(C10>25,\"C1\",IF(C10>20,\"C2\",IF(C10>15,\"D1\",IF(C10>10,\"D2\",IF(C10>5,\"E1\",IF(C10>0,\"E2\"))))))))))","v":"C1"},39,{"$f":"IF(E10>45,\"A1\",IF(E10>40,\"A2\",IF(E10>35,\"B1\",IF(E10>30,\"B2\",IF(E10>25,\"C1\",IF(E10>20,\"C2\",IF(E10>15,\"D1\",IF(E10>10,\"D2\",IF(E10>5,\"E1\",IF(E10>0,\"E2\"))))))))))","v":"B1"},82,{"$f":"IF(G10>80,\"A1\",IF(G10>70,\"A2\",IF(G10>60,\"B1\",IF(G10>50,\"B2\",IF(G10>40,\"C1\",IF(G10>30,\"C2\",IF(G10>20,\"D1\",IF(G10>10,\"D2\",IF(G10>0,\"E1\",IF(G10>0,\"E2\"))))))))))","v":"A1"},45,{"$f":"IF(I10>45,\"A1\",IF(I10>40,\"A2\",IF(I10>35,\"B1\",IF(I10>30,\"B2\",IF(I10>25,\"C1\",IF(I10>20,\"C2\",IF(I10>15,\"D1\",IF(I10>10,\"D2\",IF(I10>5,\"E1\",IF(I10>0,\"E2\"))))))))))","v":"A2"},35,{"$f":"IF(K10>45,\"A1\",IF(K10>40,\"A2\",IF(K10>35,\"B1\",IF(K10>30,\"B2\",IF(K10>25,\"C1\",IF(K10>20,\"C2\",IF(K10>15,\"D1\",IF(K10>10,\"D2\",IF(K10>5,\"E1\",IF(K10>0,\"E2\"))))))))))","v":"B2"},85,{"$f":"IF(M10>80,\"A1\",IF(M10>70,\"A2\",IF(M10>60,\"B1\",IF(M10>50,\"B2\",IF(M10>40,\"C1\",IF(M10>30,\"C2\",IF(M10>20,\"D1\",IF(M10>10,\"D2\",IF(M10>0,\"E1\",IF(M10>0,\"E2\"))))))))))","v":"A1"},{"$f":"SUM(C10,E10,G10,I10,K10,M10)","v":314},45,{"$f":"IF(P10>45,\"A1\",IF(P10>40,\"A2\",IF(P10>35,\"B1\",IF(P10>30,\"B2\",IF(P10>25,\"C1\",IF(P10>20,\"C2\",IF(P10>15,\"D1\",IF(P10>10,\"D2\",IF(P10>5,\"E1\",IF(P10>0,\"E2\"))))))))))","v":"A2"},39,{"$f":"IF(R10>45,\"A1\",IF(R10>40,\"A2\",IF(R10>35,\"B1\",IF(R10>30,\"B2\",IF(R10>25,\"C1\",IF(R10>20,\"C2\",IF(R10>15,\"D1\",IF(R10>10,\"D2\",IF(R10>5,\"E1\",IF(R10>0,\"E2\"))))))))))","v":"B1"},78,{"$f":"IF(T10>80,\"A1\",IF(T10>70,\"A2\",IF(T10>60,\"B1\",IF(T10>50,\"B2\",IF(T10>40,\"C1\",IF(T10>30,\"C2\",IF(T10>20,\"D1\",IF(T10>10,\"D2\",IF(T10>0,\"E1\",IF(T10>0,\"E2\"))))))))))","v":"A2"},39,{"$f":"IF(V10>45,\"A1\",IF(V10>40,\"A2\",IF(V10>35,\"B1\",IF(V10>30,\"B2\",IF(V10>25,\"C1\",IF(V10>20,\"C2\",IF(V10>15,\"D1\",IF(V10>10,\"D2\",IF(V10>5,\"E1\",IF(V10>0,\"E2\"))))))))))","v":"B1"},45,{"$f":"IF(X10>45,\"A1\",IF(X10>40,\"A2\",IF(X10>35,\"B1\",IF(X10>30,\"B2\",IF(X10>25,\"C1\",IF(X10>20,\"C2\",IF(X10>15,\"D1\",IF(X10>10,\"D2\",IF(X10>5,\"E1\",IF(X10>0,\"E2\"))))))))))","v":"A2"},86,{"$f":"IF(Z10>80,\"A1\",IF(Z10>70,\"A2\",IF(Z10>60,\"B1\",IF(Z10>50,\"B2\",IF(Z10>40,\"C1\",IF(Z10>30,\"C2\",IF(Z10>20,\"D1\",IF(Z10>10,\"D2\",IF(Z10>0,\"E1\",IF(Z10>0,\"E2\"))))))))))","v":"A1"},null,41,{"$f":"IF(AC10>45,\"A1\",IF(AC10>40,\"A2\",IF(AC10>35,\"B1\",IF(AC10>30,\"B2\",IF(AC10>25,\"C1\",IF(AC10>20,\"C2\",IF(AC10>15,\"D1\",IF(AC10>10,\"D2\",IF(AC10>5,\"E1\",IF(AC10>0,\"E2\"))))))))))","v":"A2"},34,"B2",64,{"$f":"IF(AG10>80,\"A1\",IF(AG10>70,\"A2\",IF(AG10>60,\"B1\",IF(AG10>50,\"B2\",IF(AG10>40,\"C1\",IF(AG10>30,\"C2\",IF(AG10>20,\"D1\",IF(AG10>10,\"D2\",IF(AG10>0,\"E1\",IF(AG10>0,\"E2\"))))))))))","v":"B1"},28,{"$f":"IF(AI10>45,\"A1\",IF(AI10>40,\"A2\",IF(AI10>35,\"B1\",IF(AI10>30,\"B2\",IF(AI10>25,\"C1\",IF(AI10>20,\"C2\",IF(AI10>15,\"D1\",IF(AI10>10,\"D2\",IF(AI10>5,\"E1\",IF(AI10>0,\"E2\"))))))))))","v":"C1"},34,{"$f":"IF(AK10>45,\"A1\",IF(AK10>40,\"A2\",IF(AK10>35,\"B1\",IF(AK10>30,\"B2\",IF(AK10>25,\"C1\",IF(AK10>20,\"C2\",IF(AK10>15,\"D1\",IF(AK10>10,\"D2\",IF(AK10>5,\"E1\",IF(AK10>0,\"E2\"))))))))))","v":"B2"},54,{"$f":"IF(AM10>80,\"A1\",IF(AM10>70,\"A2\",IF(AM10>60,\"B1\",IF(AM10>50,\"B2\",IF(AM10>40,\"C1\",IF(AM10>30,\"C2\",IF(AM10>20,\"D1\",IF(AM10>10,\"D2\",IF(AM10>0,\"E1\",IF(AM10>0,\"E2\"))))))))))","v":"B2"},255,22,"C2",39,{"$f":"IF(AR10>45,\"A1\",IF(AR10>40,\"A2\",IF(AR10>35,\"B1\",IF(AR10>30,\"B2\",IF(AR10>25,\"C1\",IF(AR10>20,\"C2\",IF(AR10>15,\"D1\",IF(AR10>10,\"D2\",IF(AR10>5,\"E1\",IF(AR10>0,\"E2\"))))))))))","v":"B1"},65,{"$f":"IF(AT10>80,\"A1\",IF(AT10>70,\"A2\",IF(AT10>60,\"B1\",IF(AT10>50,\"B2\",IF(AT10>40,\"C1\",IF(AT10>30,\"C2\",IF(AT10>20,\"D1\",IF(AT10>10,\"D2\",IF(AT10>0,\"E1\",IF(AT10>0,\"E2\"))))))))))","v":"B1"},24,{"$f":"IF(AV10>45,\"A1\",IF(AV10>40,\"A2\",IF(AV10>35,\"B1\",IF(AV10>30,\"B2\",IF(AV10>25,\"C1\",IF(AV10>20,\"C2\",IF(AV10>15,\"D1\",IF(AV10>10,\"D2\",IF(AV10>5,\"E1\",IF(AV10>0,\"E2\"))))))))))","v":"C2"},45,{"$f":"IF(AR10>45,\"A1\",IF(AR10>40,\"A2\",IF(AR10>35,\"B1\",IF(AR10>30,\"B2\",IF(AR10>25,\"C1\",IF(AR10>20,\"C2\",IF(AR10>15,\"D1\",IF(AR10>10,\"D2\",IF(AR10>5,\"E1\",IF(AR10>0,\"E2\"))))))))))","v":"B1"},86,{"$f":"IF(AZ10>80,\"A1\",IF(AZ10>70,\"A2\",IF(AZ10>60,\"B1\",IF(AZ10>50,\"B2\",IF(AZ10>40,\"C1\",IF(AZ10>30,\"C2\",IF(AZ10>20,\"D1\",IF(AZ10>10,\"D2\",IF(AZ10>0,\"E1\",IF(AZ10>0,\"E2\"))))))))))","v":"A1"},{"$f":"SUM(AP10,AR10,AT10,AV10,AX10,AZ10)","v":281},34,{"$f":"IF(BC10>45,\"A1\",IF(BC10>40,\"A2\",IF(BC10>35,\"B1\",IF(BC10>30,\"B2\",IF(BC10>25,\"C1\",IF(BC10>20,\"C2\",IF(BC10>15,\"D1\",IF(BC10>10,\"D2\",IF(BC10>5,\"E1\",IF(BC10>0,\"E2\"))))))))))","v":"B2"},34,{"$f":"IF(BE10>45,\"A1\",IF(BE10>40,\"A2\",IF(BE10>35,\"B1\",IF(BE10>30,\"B2\",IF(BE10>25,\"C1\",IF(BE10>20,\"C2\",IF(BE10>15,\"D1\",IF(BE10>10,\"D2\",IF(BE10>5,\"E1\",IF(BE10>0,\"E2\"))))))))))","v":"B2"},64,{"$f":"IF(BG10>80,\"A1\",IF(BG10>70,\"A2\",IF(BG10>60,\"B1\",IF(BG10>50,\"B2\",IF(BG10>40,\"C1\",IF(BG10>30,\"C2\",IF(BG10>20,\"D1\",IF(BG10>10,\"D2\",IF(BG10>0,\"E1\",IF(BG10>0,\"E2\"))))))))))","v":"B1"},42,{"$f":"IF(BI10>45,\"A1\",IF(BI10>40,\"A2\",IF(BI10>35,\"B1\",IF(BI10>30,\"B2\",IF(BI10>25,\"C1\",IF(BI10>20,\"C2\",IF(BI10>15,\"D1\",IF(BI10>10,\"D2\",IF(BI10>5,\"E1\",IF(BI10>0,\"E2\"))))))))))","v":"A2"},43,{"$f":"IF(BE10>45,\"A1\",IF(BE10>40,\"A2\",IF(BE10>35,\"B1\",IF(BE10>30,\"B2\",IF(BE10>25,\"C1\",IF(BE10>20,\"C2\",IF(BE10>15,\"D1\",IF(BE10>10,\"D2\",IF(BE10>5,\"E1\",IF(BE10>0,\"E2\"))))))))))","v":"B2"},33,{"$f":"IF(BM10>80,\"A1\",IF(BM10>70,\"A2\",IF(BM10>60,\"B1\",IF(BM10>50,\"B2\",IF(BM10>40,\"C1\",IF(BM10>30,\"C2\",IF(BM10>20,\"D1\",IF(BM10>10,\"D2\",IF(BM10>0,\"E1\",IF(BM10>0,\"E2\"))))))))))","v":"C2"},{"$f":"SUM(BC10,BE10,BG10,BI10,BK10,BM10)","v":250},38,"B1",45,{"$f":"IF(BR10>45,\"A1\",IF(BR10>40,\"A2\",IF(BR10>35,\"B1\",IF(BR10>30,\"B2\",IF(BR10>25,\"C1\",IF(BR10>20,\"C2\",IF(BR10>15,\"D1\",IF(BR10>10,\"D2\",IF(BR10>5,\"E1\",IF(BR10>0,\"E2\"))))))))))","v":"A2"},55,{"$f":"IF(BT10>80,\"A1\",IF(BT10>70,\"A2\",IF(BT10>60,\"B1\",IF(BT10>50,\"B2\",IF(BT10>40,\"C1\",IF(BT10>30,\"C2\",IF(BT10>20,\"D1\",IF(BT10>10,\"D2\",IF(BT10>0,\"E1\",IF(BT10>0,\"E2\"))))))))))","v":"B2"},28,{"$f":"IF(BV10>45,\"A1\",IF(BV10>40,\"A2\",IF(BV10>35,\"B1\",IF(BV10>30,\"B2\",IF(BV10>25,\"C1\",IF(BV10>20,\"C2\",IF(BV10>15,\"D1\",IF(BV10>10,\"D2\",IF(BV10>5,\"E1\",IF(BV10>0,\"E2\"))))))))))","v":"C1"},33,"B2",76,{"$f":"IF(BZ10>80,\"A1\",IF(BZ10>70,\"A2\",IF(BZ10>60,\"B1\",IF(BZ10>50,\"B2\",IF(BZ10>40,\"C1\",IF(BZ10>30,\"C2\",IF(BZ10>20,\"D1\",IF(BZ10>10,\"D2\",IF(BZ10>0,\"E1\",IF(BZ10>0,\"E2\"))))))))))","v":"A2"},{"$f":"SUM(BP10,BR10,BT10,BV10,BX10,BZ10)","v":275}]
[9502,"POONAM",23,{"$f":"IF(C11>45,\"A1\",IF(C11>40,\"A2\",IF(C11>35,\"B1\",IF(C11>30,\"B2\",IF(C11>25,\"C1\",IF(C11>20,\"C2\",IF(C11>15,\"D1\",IF(C11>10,\"D2\",IF(C11>5,\"E1\",IF(C11>0,\"E2\"))))))))))","v":"C2"},28,{"$f":"IF(E11>45,\"A1\",IF(E11>40,\"A2\",IF(E11>35,\"B1\",IF(E11>30,\"B2\",IF(E11>25,\"C1\",IF(E11>20,\"C2\",IF(E11>15,\"D1\",IF(E11>10,\"D2\",IF(E11>5,\"E1\",IF(E11>0,\"E2\"))))))))))","v":"C1"},75,"A2",34,{"$f":"IF(I11>45,\"A1\",IF(I11>40,\"A2\",IF(I11>35,\"B1\",IF(I11>30,\"B2\",IF(I11>25,\"C1\",IF(I11>20,\"C2\",IF(I11>15,\"D1\",IF(I11>10,\"D2\",IF(I11>5,\"E1\",IF(I11>0,\"E2\"))))))))))","v":"B2"},39,{"$f":"IF(K11>45,\"A1\",IF(K11>40,\"A2\",IF(K11>35,\"B1\",IF(K11>30,\"B2\",IF(K11>25,\"C1\",IF(K11>20,\"C2\",IF(K11>15,\"D1\",IF(K11>10,\"D2\",IF(K11>5,\"E1\",IF(K11>0,\"E2\"))))))))))","v":"B1"},75,{"$f":"IF(M11>80,\"A1\",IF(M11>70,\"A2\",IF(M11>60,\"B1\",IF(M11>50,\"B2\",IF(M11>40,\"C1\",IF(M11>30,\"C2\",IF(M11>20,\"D1\",IF(M11>10,\"D2\",IF(M11>0,\"E1\",IF(M11>0,\"E2\"))))))))))","v":"A2"},{"$f":"SUM(C11,E11,G11,I11,K11,M11)","v":274},23,"C2",28,"C1",81,"A1",38,"B1",23,"C2",64,"B1",{"$f":"SUM(P11,R11,T11,V11,X11,Z11)","v":257},22,{"$f":"IF(AC11>45,\"A1\",IF(AC11>40,\"A2\",IF(AC11>35,\"B1\",IF(AC11>30,\"B2\",IF(AC11>25,\"C1\",IF(AC11>20,\"C2\",IF(AC11>15,\"D1\",IF(AC11>10,\"D2\",IF(AC11>5,\"E1\",IF(AC11>0,\"E2\"))))))))))","v":"C2"},30,"C1",67,"B1",29,"C1",30,"C1",76,"A2",256,30,"C1",28,"C1",76,"A2",23,"C2",23,"C1",64,"B1",{"$f":"SUM(AP11,AR11,AT11,AV11,AX11,AZ11)","v":244},30,"C1",44,"A2",67,"B1",38,"B1",35,"A2",22,"D1",{"$f":"SUM(BC11,BE11,BG11,BI11,BK11,BM11)","v":236},47,"A1",23,"C2",76,"A2",29,"C1",22,"C2",54,"B2",{"$f":"SUM(BP11,BR11,BT11,BV11,BX11,BZ11)","v":251}]
[9503,"SHIVANI BHOWRA",29,"C1",23,"C2",73,{"$f":"IF(G12>80,\"A1\",IF(G12>70,\"A2\",IF(G12>60,\"B1\",IF(G12>50,\"B2\",IF(G12>40,\"C1\",IF(G12>30,\"C2\",IF(G12>20,\"D1\",IF(G12>10,\"D2\",IF(G12>0,\"E1\",IF(G12>0,\"E2\"))))))))))","v":"A2"},37,{"$f":"IF(I12>45,\"A1\",IF(I12>40,\"A2\",IF(I12>35,\"B1\",IF(I12>30,\"B2\",IF(I12>25,\"C1\",IF(I12>20,\"C2\",IF(I12>15,\"D1\",IF(I12>10,\"D2\",IF(I12>5,\"E1\",IF(I12>0,\"E2\"))))))))))","v":"B1"},38,"B1",47,"C1",247,34,"B2",24,"C2",65,"B1",32,"B2",34,"B2",67,"B1",256,30,{"$f":"IF(AC12>45,\"A1\",IF(AC12>40,\"A2\",IF(AC12>35,\"B1\",IF(AC12>30,\"B2\",IF(AC12>25,\"C1\",IF(AC12>20,\"C2\",IF(AC12>15,\"D1\",IF(AC12>10,\"D2\",IF(AC12>5,\"E1\",IF(AC12>0,\"E2\"))))))))))","v":"C1"},41,"A2",76,"A2",39,"B1",41,"A2",54,"B2",257,25,"C2",24,"C2",64,"B1",25,"C2",34,"C2",67,"B1",239,41,"A2",23,"C2",76,"A2",36,"B1",31,"C2",30,"D1",237,37,"B1",34,"B2",35,"C2",39,"B1",30,"C1",76,"A2",251]
[9504,"SWATI",38,"B1",45,"A2",85,{"$f":"IF(G13>80,\"A1\",IF(G13>70,\"A2\",IF(G13>60,\"B1\",IF(G13>50,\"B2\",IF(G13>40,\"C1\",IF(G13>30,\"C2\",IF(G13>20,\"D1\",IF(G13>10,\"D2\",IF(G13>0,\"E1\",IF(G13>0,\"E2\"))))))))))","v":"A1"},39,{"$f":"IF(I13>45,\"A1\",IF(I13>40,\"A2\",IF(I13>35,\"B1\",IF(I13>30,\"B2\",IF(I13>25,\"C1\",IF(I13>20,\"C2\",IF(I13>15,\"D1\",IF(I13>10,\"D2\",IF(I13>5,\"E1\",IF(I13>0,\"E2\"))))))))))","v":"B1"},28,"C1",37,"C2",272,30,"C1",23,"C2",76,"A2",43,"A2",30,"C1",76,"A2",278,25,{"$f":"IF(AC13>45,\"A1\",IF(AC13>40,\"A2\",IF(AC13>35,\"B1\",IF(AC13>30,\"B2\",IF(AC13>25,\"C1\",IF(AC13>20,\"C2\",IF(AC13>15,\"D1\",IF(AC13>10,\"D2\",IF(AC13>5,\"E1\",IF(AC13>0,\"E2\"))))))))))","v":"C2"},12,"D2",35,"C2",29,"C1",12,"D2",65,"B1",258,35,"B2",23,"C2",56,"B2",34,"B2",30,"C2",76,"A2",254,12,"D2",34,"B2",35,"C2",29,"C1",28,"B2",25,"D1",163,28,"C1",30,"C1",76,"A2",29,"C1",25,"C2",54,"B2",242]
[9505,"KRITI",41,"A2",39,"B1",26,"D1",39,{"$f":"IF(I14>45,\"A1\",IF(I14>40,\"A2\",IF(I14>35,\"B1\",IF(I14>30,\"B2\",IF(I14>25,\"C1\",IF(I14>20,\"C2\",IF(I14>15,\"D1\",IF(I14>10,\"D2\",IF(I14>5,\"E1\",IF(I14>0,\"E2\"))))))))))","v":"B1"},29,"C1",36,"C2",210,41,"A2",25,"C2",64,"B1",44,"A2",41,"A2",35,"C2",250,35,{"$f":"IF(AC14>45,\"A1\",IF(AC14>40,\"A2\",IF(AC14>35,\"B1\",IF(AC14>30,\"B2\",IF(AC14>25,\"C1\",IF(AC14>20,\"C2\",IF(AC14>15,\"D1\",IF(AC14>10,\"D2\",IF(AC14>5,\"E1\",IF(AC14>0,\"E2\"))))))))))","v":"B2"},12,"D2",76,"A2",38,"B1",12,"D2",76,"A2",259,28,"C1",25,"C2",76,"A2",30,"C1",41,"C2",35,"C2",235,12,"D2",44,"A2",76,"A2",31,"B2",38,"A2",64,"B1",265,28,"C1",41,"A2",87,"A1",38,"B1",35,"B2",65,"B1",294]
[9506,"NEETU",24,"C2",27,"C1",56,"B2",28,{"$f":"IF(I15>45,\"A1\",IF(I15>40,\"A2\",IF(I15>35,\"B1\",IF(I15>30,\"B2\",IF(I15>25,\"C1\",IF(I15>20,\"C2\",IF(I15>15,\"D1\",IF(I15>10,\"D2\",IF(I15>5,\"E1\",IF(I15>0,\"E2\"))))))))))","v":"C1"},39,"B1",46,"C1",220,12,"D2",45,"A2",56,"B2",29,"C1",12,"D2",76,"A2",230,28,{"$f":"IF(AC15>45,\"A1\",IF(AC15>40,\"A2\",IF(AC15>35,\"B1\",IF(AC15>30,\"B2\",IF(AC15>25,\"C1\",IF(AC15>20,\"C2\",IF(AC15>15,\"D1\",IF(AC15>10,\"D2\",IF(AC15>5,\"E1\",IF(AC15>0,\"E2\"))))))))))","v":"C1"},34,"B2",87,"A1",22,"C2",34,"B2",45,"C1",260,40,"B1",45,"A2",87,"A1",41,"A2",12,"A2",76,"A2",301,34,"B2",45,"A2",87,"A1",36,"B1",14,"A2",67,"B1",283,36,"B1",12,"D2",54,"B2",22,"C2",28,"C1",76,"A2",228]
[9507,"SHREYA",42,"A2",45,"A2",84,"A1",24,{"$f":"IF(I16>45,\"A1\",IF(I16>40,\"A2\",IF(I16>35,\"B1\",IF(I16>30,\"B2\",IF(I16>25,\"C1\",IF(I16>20,\"C2\",IF(I16>15,\"D1\",IF(I16>10,\"D2\",IF(I16>5,\"E1\",IF(I16>0,\"E2\"))))))))))","v":"C2"},29,"C1",57,"B2",281,12,"D2",45,"A2",76,"A2",39,"B1",12,"D2",87,"A1",271,40,{"$f":"IF(AC16>45,\"A1\",IF(AC16>40,\"A2\",IF(AC16>35,\"B1\",IF(AC16>30,\"B2\",IF(AC16>25,\"C1\",IF(AC16>20,\"C2\",IF(AC16>15,\"D1\",IF(AC16>10,\"D2\",IF(AC16>5,\"E1\",IF(AC16>0,\"E2\"))))))))))","v":"B1"},38,"B1",54,"B2",33,"B2",38,"B1",45,"C1",261,33,"B2",46,"A1",54,"B2",12,"D2",12,"A1",87,"A1",244,38,"B1",23,"C2",54,"B2",28,"C1",20,"C2",76,"A2",239,35,"B2",12,"D2",76,"A2",33,"B2",40,"B1",45,"C1",241]
[9508,"HIMANSHI",34,"B2",39,"B1",75,"A2",23,"C2",38,"B1",36,"C2",245,34,"B2",23,"C2",87,"A1",28,"C1",34,"B2",54,"B2",260,33,{"$f":"IF(AC17>45,\"A1\",IF(AC17>40,\"A2\",IF(AC17>35,\"B1\",IF(AC17>30,\"B2\",IF(AC17>25,\"C1\",IF(AC17>20,\"C2\",IF(AC17>15,\"D1\",IF(AC17>10,\"D2\",IF(AC17>5,\"E1\",IF(AC17>0,\"E2\"))))))))))","v":"B2"},29,"C1",76,"A2",22,"C2",29,"C1",76,"A2",262,39,"B1",45,"A2",86,"A1",12,"D2",34,"A2",54,"B2",270,29,"C1",34,"B2",76,"A2",43,"A2",39,"B2",35,"C2",256,37,"B1",34,"B2",54,"B2",22,"C2",28,"C1",45,"C1",220]
[9509,"CHANCHAL DASS",43,"A2",37,"B1",47,"C1",25,"C2",22,"C2",76,"A2",250,38,"B1",34,"B2",54,"B2",23,"C2",38,"B1",76,"A2",263,39,{"$f":"IF(AC18>45,\"A1\",IF(AC18>40,\"A2\",IF(AC18>35,\"B1\",IF(AC18>30,\"B2\",IF(AC18>25,\"C1\",IF(AC18>20,\"C2\",IF(AC18>15,\"D1\",IF(AC18>10,\"D2\",IF(AC18>5,\"E1\",IF(AC18>0,\"E2\"))))))))))","v":"B1"},38,"B1",54,"B2",30,"C1",38,"B1",76,"A2",263,38,"B1",23,"C2",64,"B1",34,"B2",38,"C2",82,"A1",279,38,"B1",30,"C1",54,"B2",35,"B2",28,"C1",76,"A2",261,42,"A2",38,"B1",76,"A2",30,"C1",29,"C1",76,"A2",291]
[9510,"TANIYA CHAUHAN",34,"B2",37,"B1",37,"C2",45,"A2",33,"B2",64,"B1",250,29,"C1",30,"C1",86,"A1",45,"A2",29,"C1",54,"B2",273,38,{"$f":"IF(AC19>45,\"A1\",IF(AC19>40,\"A2\",IF(AC19>35,\"B1\",IF(AC19>30,\"B2\",IF(AC19>25,\"C1\",IF(AC19>20,\"C2\",IF(AC19>15,\"D1\",IF(AC19>10,\"D2\",IF(AC19>5,\"E1\",IF(AC19>0,\"E2\"))))))))))","v":"B1"},22,"C2",76,"A2",25,"C2",39,"B1",55,"B2",264,32,"B2",34,"B2",67,"B1",38,"B1",29,"B2",75,"A2",275,12,"D2",41,"A2",76,"A2",31,"B2",38,"A2",87,"A1",285,33,"B2",29,"C1",54,"B2",25,"C2",39,"B1",76,"A2",256]
[9511,"LOVELY",39,"B1",39,"B1",36,"C2",23,"C2",22,"C2",75,"A2",234,38,"B1",41,"A2",64,"B1",39,"B1",38,"B1",76,"A2",296,32,{"$f":"IF(AC20>45,\"A1\",IF(AC20>40,\"A2\",IF(AC20>35,\"B1\",IF(AC20>30,\"B2\",IF(AC20>25,\"C1\",IF(AC20>20,\"C2\",IF(AC20>15,\"D1\",IF(AC20>10,\"D2\",IF(AC20>5,\"E1\",IF(AC20>0,\"E2\"))))))))))","v":"B2"},30,"C1",54,"B2",35,"B2",28,"C1",76,"A2",265,43,"A2",30,"C1",76,"A2",29,"C1",38,"C1",73,"A2",289,12,"D2",12,"D2",54,"B2",28,"C1",47,"D2",54,"B2",207,34,"B2",38,"B1",65,"B1",35,"B2",29,"C1",55,"B2",256]
[9512,"JAYA ",29,"C1",20,"D1",46,"C1",34,"B2",30,"C1",63,"B1",222,39,"B1",12,"D2",67,"B1",27,"C1",41,"A2",54,"B2",240,43,{"$f":"IF(AC21>45,\"A1\",IF(AC21>40,\"A2\",IF(AC21>35,\"B1\",IF(AC21>30,\"B2\",IF(AC21>25,\"C1\",IF(AC21>20,\"C2\",IF(AC21>15,\"D1\",IF(AC21>10,\"D2\",IF(AC21>5,\"E1\",IF(AC21>0,\"E2\"))))))))))","v":"A2"},25,"C2",65,"B1",28,"C1",24,"C2",35,"C2",266,44,"A2",41,"A2",35,"C2",38,"B1",41,"A2",85,"A1",284,34,"B2",12,"D2",65,"B1",38,"B1",37,"D2",76,"A2",262,30,"C1",41,"A2",76,"A2",28,"C1",38,"B1",76,"A2",289]
[9513,"BHAVNA",42,"A2",48,"A1",57,"B2",30,"C1",25,"C2",76,"A2",278,28,"C1",12,"D2",76,"A2",45,"A2",39,"B1",65,"B1",265,44,{"$f":"IF(AC22>45,\"A1\",IF(AC22>40,\"A2\",IF(AC22>35,\"B1\",IF(AC22>30,\"B2\",IF(AC22>25,\"C1\",IF(AC22>20,\"C2\",IF(AC22>15,\"D1\",IF(AC22>10,\"D2\",IF(AC22>5,\"E1\",IF(AC22>0,\"E2\"))))))))))","v":"A2"},35,"B2",76,"A2",40,"B1",23,"C2",76,"A2",267,29,"C1",12,"D2",76,"A2",35,"B2",39,"D2",26,"D1",217,38,"B1",34,"B2",76,"A2",14,"D2",28,"B2",54,"B2",244,41,"A2",39,"B1",45,"C1",40,"B1",22,"C2",76,"A2",263]
[9514,"POOJA",38,"B1",39,"B1",36,"C2",41,"A2",35,"B2",64,"B1",253,24,"C2",34,"B2",35,"C2",39,"B1",38,"B1",76,"A2",246,29,{"$f":"IF(AC23>45,\"A1\",IF(AC23>40,\"A2\",IF(AC23>35,\"B1\",IF(AC23>30,\"B2\",IF(AC23>25,\"C1\",IF(AC23>20,\"C2\",IF(AC23>15,\"D1\",IF(AC23>10,\"D2\",IF(AC23>5,\"E1\",IF(AC23>0,\"E2\"))))))))))","v":"C1"},28,"C1",45,"C1",33,"B2",25,"C2",87,"A1",268,39,"B1",12,"D2",87,"A1",28,"C1",38,"D2",56,"B2",260,29,"C1",38,"B1",45,"C1",39,"B1",28,"B1",76,"A2",255,12,"D2",38,"B1",45,"C1",33,"B2",33,"B2",64,"B1",225]
[9515,"KRITIKA ",36,"B1",40,"B1",76,"A2",12,"D2",28,"C1",67,"B1",259,23,"C2",38,"B1",76,"A2",37,"B1",28,"C1",54,"B2",256,39,{"$f":"IF(AC24>45,\"A1\",IF(AC24>40,\"A2\",IF(AC24>35,\"B1\",IF(AC24>30,\"B2\",IF(AC24>25,\"C1\",IF(AC24>20,\"C2\",IF(AC24>15,\"D1\",IF(AC24>10,\"D2\",IF(AC24>5,\"E1\",IF(AC24>0,\"E2\"))))))))))","v":"B1"},40,"B1",45,"C1",39,"B1",45,"A2",54,"B2",269,28,"C1",34,"B2",54,"B2",40,"B1",28,"B2",84,"A1",268,38,"B1",29,"C1",45,"C1",28,"C1",36,"C1",54,"B2",230,12,"D2",28,"C1",76,"A2",39,"B1",22,"C2",67,"B1",244]
[9516,"NEERA",29,"C1",43,"A2",64,"B1",12,"D2",40,"B1",76,"A2",264,25,"C2",29,"C1",87,"A1",37,"B1",29,"C1",67,"B1",274,28,{"$f":"IF(AC25>45,\"A1\",IF(AC25>40,\"A2\",IF(AC25>35,\"B1\",IF(AC25>30,\"B2\",IF(AC25>25,\"C1\",IF(AC25>20,\"C2\",IF(AC25>15,\"D1\",IF(AC25>10,\"D2\",IF(AC25>5,\"E1\",IF(AC25>0,\"E2\"))))))))))","v":"C1"},33,"B2",76,"A2",38,"B1",28,"C1",76,"A2",270,23,"C2",38,"B1",76,"A2",33,"B2",29,"B1",75,"A2",274,41,"A2",38,"B1",76,"A2",24,"C2",35,"B1",65,"B1",279,34,"B2",29,"C1",76,"A2",38,"B1",30,"C1",76,"A2",283]
[9517,"PRAGYA",31,"B2",48,"A1",75,"A2",34,"B2",33,"B2",35,"C2",256,45,"A2",38,"B1",54,"B2",39,"B1",39,"B1",81,"A1",296,23,{"$f":"IF(AC26>45,\"A1\",IF(AC26>40,\"A2\",IF(AC26>35,\"B1\",IF(AC26>30,\"B2\",IF(AC26>25,\"C1\",IF(AC26>20,\"C2\",IF(AC26>15,\"D1\",IF(AC26>10,\"D2\",IF(AC26>5,\"E1\",IF(AC26>0,\"E2\"))))))))))","v":"C2"},39,"B1",76,"A2",32,"B2",40,"B1",54,"B2",271,45,"A2",29,"C1",54,"B2",39,"B1",39,"C1",47,"C1",253,39,"B1",41,"A2",76,"A2",38,"B1",37,"A2",76,"A2",307,38,"B1",39,"B1",55,"B2",32,"B2",25,"C2",35,"C2",224]
[9518,"SADAF",36,"B1",33,"B2",63,"B1",38,"B1",39,"B1",76,"A2",285,23,"C2",41,"A2",76,"A2",20,"D1",29,"C1",65,"B1",254,45,{"$f":"IF(AC27>45,\"A1\",IF(AC27>40,\"A2\",IF(AC27>35,\"B1\",IF(AC27>30,\"B2\",IF(AC27>25,\"C1\",IF(AC27>20,\"C2\",IF(AC27>15,\"D1\",IF(AC27>10,\"D2\",IF(AC27>5,\"E1\",IF(AC27>0,\"E2\"))))))))))","v":"A2"},38,"B1",55,"B2",43,"A2",33,"B2",76,"A2",272,39,"B1",38,"B1",76,"A2",38,"B1",29,"B1",37,"C2",257,38,"B1",39,"B1",55,"B2",34,"B2",42,"B1",45,"C1",253,29,"C1",29,"C1",76,"A2",43,"A2",35,"B2",76,"A2",288]
[9519,"DIVYA KHARAKWAL",28,"C1",37,"B1",76,"A2",29,"C1",38,"B1",87,"A1",295,45,"A2",39,"B1",54,"B2",48,"A1",38,"B1",76,"A2",300,39,{"$f":"IF(AC28>45,\"A1\",IF(AC28>40,\"A2\",IF(AC28>35,\"B1\",IF(AC28>30,\"B2\",IF(AC28>25,\"C1\",IF(AC28>20,\"C2\",IF(AC28>15,\"D1\",IF(AC28>10,\"D2\",IF(AC28>5,\"E1\",IF(AC28>0,\"E2\"))))))))))","v":"B1"},32,"B2",76,"A2",44,"A2",39,"B1",54,"B2",273,27,"C1",41,"A2",54,"B2",32,"B2",38,"A2",36,"C2",228,28,"C1",38,"B1",86,"A1",34,"B2",33,"B1",45,"C1",264,38,"B1",38,"B1",76,"A2",44,"A2",28,"C1",87,"A1",311]
[9520,"SIMRAN",43,"A2",29,"C1",85,"A1",38,"B1",32,"B2",54,"B2",281,39,"B1",38,"B1",76,"A2",39,"B1",22,"C2",64,"B1",278,27,{"$f":"IF(AC29>45,\"A1\",IF(AC29>40,\"A2\",IF(AC29>35,\"B1\",IF(AC29>30,\"B2\",IF(AC29>25,\"C1\",IF(AC29>20,\"C2\",IF(AC29>15,\"D1\",IF(AC29>10,\"D2\",IF(AC29>5,\"E1\",IF(AC29>0,\"E2\"))))))))))","v":"C1"},43,"A2",76,"A2",29,"C1",38,"B1",65,"B1",274,45,"A2",39,"B1",65,"B1",43,"A2",22,"B1",46,"C1",260,29,"C1",28,"C1",65,"B1",30,"C1",37,"C1",54,"B2",243,41,"A2",22,"C2",65,"B1",22,"C2",40,"B1",54,"B2",244]
[9521,"RITIKA",35,"B2",40,"B1",63,"B1",41,"A2",43,"A2",76,"A2",298,27,"C1",28,"C1",54,"B2",40,"B1",33,"B2",56,"B2",238,45,{"$f":"IF(AC30>45,\"A1\",IF(AC30>40,\"A2\",IF(AC30>35,\"B1\",IF(AC30>30,\"B2\",IF(AC30>25,\"C1\",IF(AC30>20,\"C2\",IF(AC30>15,\"D1\",IF(AC30>10,\"D2\",IF(AC30>5,\"E1\",IF(AC30>0,\"E2\"))))))))))","v":"A2"},44,"A2",65,"B1",39,"B1",32,"B2",76,"A2",275,39,"B1",38,"B1",76,"A2",44,"A2",33,"B1",57,"B2",287,39,"B1",29,"C1",53,"B2",41,"A2",37,"C1",65,"B1",264,39,"B1",33,"B2",66,"B1",33,"B2",33,"B2",76,"A2",280]
[9522,"NITI ",31,"B2",41,"A2",56,"B2",39,"B1",44,"A2",54,"B2",265,45,"A2",29,"C1",65,"B1",43,"A2",22,"C2",76,"A2",280,39,{"$f":"IF(AC31>45,\"A1\",IF(AC31>40,\"A2\",IF(AC31>35,\"B1\",IF(AC31>30,\"B2\",IF(AC31>25,\"C1\",IF(AC31>20,\"C2\",IF(AC31>15,\"D1\",IF(AC31>10,\"D2\",IF(AC31>5,\"E1\",IF(AC31>0,\"E2\"))))))))))","v":"B1"},29,"C1",66,"B1",28,"C1",43,"A2",45,"C1",276,37,"B1",28,"C1",45,"C1",29,"C1",22,"C1",36,"C2",197,45,"A2",39,"B1",76,"A2",12,"D2",39,"B1",76,"A2",287,38,"B1",22,"C2",65,"B1",22,"C2",39,"B1",54,"B2",240]
[9523,"AMISHA",28,"C1",37,"B1",75,"A2",38,"B1",29,"C1",76,"A2",283,39,"B1",39,"B1",76,"A2",48,"A1",30,"C1",87,"A1",319,37,{"$f":"IF(AC32>45,\"A1\",IF(AC32>40,\"A2\",IF(AC32>35,\"B1\",IF(AC32>30,\"B2\",IF(AC32>25,\"C1\",IF(AC32>20,\"C2\",IF(AC32>15,\"D1\",IF(AC32>10,\"D2\",IF(AC32>5,\"E1\",IF(AC32>0,\"E2\"))))))))))","v":"B1"},39,"B1",65,"B1",23,"C2",44,"A2",45,"C1",277,37,"B1",29,"C1",45,"C1",30,"C1",30,"C1",76,"A2",247,23,"C2",29,"C1",76,"A2",12,"D2",46,"C1",64,"B1",250,28,"C1",30,"C1",65,"B1",30,"C1",38,"B1",76,"A2",267]
[9524,"GOPIKA",38,"B1",39,"B1",67,"B1",28,"C1",39,"B1",54,"B2",265,37,"B1",29,"C1",45,"C1",29,"C1",25,"C2",54,"B2",219,37,{"$f":"IF(AC33>45,\"A1\",IF(AC33>40,\"A2\",IF(AC33>35,\"B1\",IF(AC33>30,\"B2\",IF(AC33>25,\"C1\",IF(AC33>20,\"C2\",IF(AC33>15,\"D1\",IF(AC33>10,\"D2\",IF(AC33>5,\"E1\",IF(AC33>0,\"E2\"))))))))))","v":"B1"},28,"C1",65,"B1",45,"A2",29,"C1",76,"A2",278,39,"B1",39,"B1",76,"A2",41,"A2",25,"B1",64,"B1",284,34,"B2",38,"B1",39,"C2",34,"B2",49,"B1",67,"B1",261,29,"C1",25,"C2",87,"A1",25,"C2",32,"B2",54,"B2",252]
[9525,"MAHIMA",14,"D2",32,"B2",46,"C1",29,"C1",28,"C1",65,"B1",214,37,"B1",38,"B1",45,"C1",38,"B1",32,"B2",86,"A1",276,39,{"$f":"IF(AC34>45,\"A1\",IF(AC34>40,\"A2\",IF(AC34>35,\"B1\",IF(AC34>30,\"B2\",IF(AC34>25,\"C1\",IF(AC34>20,\"C2\",IF(AC34>15,\"D1\",IF(AC34>10,\"D2\",IF(AC34>5,\"E1\",IF(AC34>0,\"E2\"))))))))))","v":"B1"},23,"C2",87,"A1",39,"B1",46,"A1",76,"A2",279,20,"D1",29,"C1",76,"A2",12,"D2",32,"C1",75,"A2",244,30,"C1",22,"C2",28,"D1",38,"B1",28,"C2",76,"A2",222,39,"B1",32,"B2",76,"A2",32,"B2",43,"A2",65,"B1",287]
[9526,"RAGINI",39,"B1",37,"B1",47,"C1",39,"B1",23,"C2",76,"A2",261,39,"B1",22,"C2",76,"A2",41,"A2",33,"B2",64,"B1",275,20,{"$f":"IF(AC35>45,\"A1\",IF(AC35>40,\"A2\",IF(AC35>35,\"B1\",IF(AC35>30,\"B2\",IF(AC35>25,\"C1\",IF(AC35>20,\"C2\",IF(AC35>15,\"D1\",IF(AC35>10,\"D2\",IF(AC35>5,\"E1\",IF(AC35>0,\"E2\"))))))))))","v":"D1"},45,"A2",76,"A2",27,"C1",45,"A2",55,"B2",280,48,"A1",38,"B1",55,"B2",12,"D2",33,"B1",63,"B1",249,41,"A2",33,"B2",38,"C2",29,"C1",39,"B2",35,"C2",215,29,"C1",33,"B2",54,"B2",33,"B2",44,"A2",76,"A2",269]
[9527,"SHRUTI",28,"C1",38,"B1",59,"B2",29,"C1",45,"A2",45,"C1",244,20,"D1",33,"B2",76,"A2",24,"C2",42,"A2",67,"B1",262,48,{"$f":"IF(AC36>45,\"A1\",IF(AC36>40,\"A2\",IF(AC36>35,\"B1\",IF(AC36>30,\"B2\",IF(AC36>25,\"C1\",IF(AC36>20,\"C2\",IF(AC36>15,\"D1\",IF(AC36>10,\"D2\",IF(AC36>5,\"E1\",IF(AC36>0,\"E2\"))))))))))","v":"A1"},39,"B1",45,"C1",45,"A2",23,"C2",76,"A2",281,39,"B1",22,"C2",86,"A1",34,"B2",42,"C2",76,"A2",299,12,"D2",22,"C2",47,"C1",38,"B1",39,"C2",66,"B1",224,38,"B1",42,"A2",76,"A2",42,"A2",29,"C1",45,"C1",272]
[9528,"SHAMA",24,"C2",20,"D1",69,"B1",38,"B1",39,"B1",45,"C1",235,48,"A1",22,"C2",55,"B2",42,"A2",43,"A2",76,"A2",286,39,{"$f":"IF(AC37>45,\"A1\",IF(AC37>40,\"A2\",IF(AC37>35,\"B1\",IF(AC37>30,\"B2\",IF(AC37>25,\"C1\",IF(AC37>20,\"C2\",IF(AC37>15,\"D1\",IF(AC37>10,\"D2\",IF(AC37>5,\"E1\",IF(AC37>0,\"E2\"))))))))))","v":"B1"},27,"C1",23,"D1",39,"B1",34,"B2",76,"A2",282,40,"B1",33,"B2",65,"B1",38,"B1",43,"B2",85,"A1",304,12,"D2",30,"C1",37,"C2",12,"D2",29,"C1",35,"C2",155,22,"C2",43,"A2",54,"B2",43,"A2",39,"B1",45,"C1",246]
[9529,"KOMAL",38,"B1",39,"B1",75,"A2",22,"C2",27,"C1",76,"A2",277,39,"B1",30,"C1",86,"A1",34,"B2",39,"B1",35,"C2",263,40,{"$f":"IF(AC38>45,\"A1\",IF(AC38>40,\"A2\",IF(AC38>35,\"B1\",IF(AC38>30,\"B2\",IF(AC38>25,\"C1\",IF(AC38>20,\"C2\",IF(AC38>15,\"D1\",IF(AC38>10,\"D2\",IF(AC38>5,\"E1\",IF(AC38>0,\"E2\"))))))))))","v":"B1"},45,"A2",34,"C2",37,"B1",30,"C1",65,"B1",283,43,"A2",22,"C2",53,"B2",29,"C1",39,"C2",63,"B1",249,34,"B2",25,"C2",28,"D1",12,"D2",20,"C2",76,"A2",195,33,"B2",39,"B1",65,"B1",39,"B1",28,"C1",76,"A2",280]
[9530,"KARTIKA",34,"B2",28,"C1",74,"A2",33,"B2",45,"A2",76,"A2",290,40,"B1",25,"C2",65,"B1",43,"A2",29,"C1",76,"A2",278,43,{"$f":"IF(AC39>45,\"A1\",IF(AC39>40,\"A2\",IF(AC39>35,\"B1\",IF(AC39>30,\"B2\",IF(AC39>25,\"C1\",IF(AC39>20,\"C2\",IF(AC39>15,\"D1\",IF(AC39>10,\"D2\",IF(AC39>5,\"E1\",IF(AC39>0,\"E2\"))))))))))","v":"A2"},39,"B1",30,"D1",37,"B1",41,"A2",66,"B1",284,48,"A1",30,"C1",76,"A2",38,"B1",29,"C1",56,"B2",277,38,"B1",32,"B2",28,"D1",34,"B2",28,"B2",87,"A1",247,22,"C2",29,"C1",null,false,29,"C1",23,"C2",76,"A2",179]
[9531,"RAFIYA",30,"C1",38,"B1",68,"B1",22,"C2",39,"B1",55,"B2",252,43,"A2",32,"B2",53,"B2",34,"B2",20,"D1",87,"A1",269,48,{"$f":"IF(AC40>45,\"A1\",IF(AC40>40,\"A2\",IF(AC40>35,\"B1\",IF(AC40>30,\"B2\",IF(AC40>25,\"C1\",IF(AC40>20,\"C2\",IF(AC40>15,\"D1\",IF(AC40>10,\"D2\",IF(AC40>5,\"E1\",IF(AC40>0,\"E2\"))))))))))","v":"A1"},37,"B1",41,"C1",39,"B1",12,"D2",65,"B1",285,29,"C1",25,"C2",76,"A2",35,"B2",20,"C2",75,"A2",260,29,"C1",33,"B2",36,"C2",38,"B1",28,"B2",54,"B2",218,30,"C1",20,"D1",55,"B2",20,"D1",45,"A2",55,"B2",225]
[9532,"SHALINI",38,"B1",47,"A1",64,"B1",30,"C1",37,"B1",86,"A1",302,48,"A1",33,"B2",76,"A2",39,"B1",38,"B1",64,"B1",298,29,{"$f":"IF(AC41>45,\"A1\",IF(AC41>40,\"A2\",IF(AC41>35,\"B1\",IF(AC41>30,\"B2\",IF(AC41>25,\"C1\",IF(AC41>20,\"C2\",IF(AC41>15,\"D1\",IF(AC41>10,\"D2\",IF(AC41>5,\"E1\",IF(AC41>0,\"E2\"))))))))))","v":"C1"},37,"B1",12,"D2",20,"D1",12,"D2",65,"B1",286,38,"B1",32,"B2",65,"B1",28,"C1",38,{"$f":"IF(AR41>45,\"A1\",IF(AR41>40,\"A2\",IF(AR41>35,\"B1\",IF(AR41>30,\"B2\",IF(AR41>25,\"C1\",IF(AR41>20,\"C2\",IF(AR41>15,\"D1\",IF(AR41>10,\"D2\",IF(AR41>5,\"E1\",IF(AR41>0,\"E2\"))))))))))","v":"B2"},67,"B1",268,38,"B1",42,"A2",35,"C2",29,"C1",20,"A2",76,"A2",240,25,"C2",38,"B1",76,"A2",38,"B1",39,"B1",86,"A1",302]
[9533,"ANUSHKA",32,"B2",37,"B1",67,"B1",25,"C2",37,"B1",65,"B1",263,33,{"$f":"IF(P42>45,\"A1\",IF(P42>40,\"A2\",IF(P42>35,\"B1\",IF(P42>30,\"B2\",IF(P42>25,\"C1\",IF(P42>20,\"C2\",IF(P42>15,\"D1\",IF(P42>10,\"D2\",IF(P42>5,\"E1\",IF(P42>0,\"E2\"))))))))))","v":"B2"},42,"A2",76,"A2",29,"C1",37,{"$f":"IF(X42>45,\"A1\",IF(X42>40,\"A2\",IF(X42>35,\"B1\",IF(X42>30,\"B2\",IF(X42>25,\"C1\",IF(X42>20,\"C2\",IF(X42>15,\"D1\",IF(X42>10,\"D2\",IF(X42>5,\"E1\",IF(X42>0,\"E2\"))))))))))","v":"B1"},67,"B1",284,38,{"$f":"IF(AC42>45,\"A1\",IF(AC42>40,\"A2\",IF(AC42>35,\"B1\",IF(AC42>30,\"B2\",IF(AC42>25,\"C1\",IF(AC42>20,\"C2\",IF(AC42>15,\"D1\",IF(AC42>10,\"D2\",IF(AC42>5,\"E1\",IF(AC42>0,\"E2\"))))))))))","v":"B1"},39,{"$f":"IF(AE42>45,\"A1\",IF(AE42>40,\"A2\",IF(AE42>35,\"B1\",IF(AE42>30,\"B2\",IF(AE42>25,\"C1\",IF(AE42>20,\"C2\",IF(AE42>15,\"D1\",IF(AE42>10,\"D2\",IF(AE42>5,\"E1\",IF(AE42>0,\"E2\"))))))))))","v":"B1"},12,"D2",48,"A1",34,"B2",87,"A1",287,41,{"$f":"IF(AP42>45,\"A1\",IF(AP42>40,\"A2\",IF(AP42>35,\"B1\",IF(AP42>30,\"B2\",IF(AP42>25,\"C1\",IF(AP42>20,\"C2\",IF(AP42>15,\"D1\",IF(AP42>10,\"D2\",IF(AP42>5,\"E1\",IF(AP42>0,\"E2\"))))))))))","v":"A2"},33,"B2",66,"B1",40,"B1",37,"B2",46,"C1",263,41,"A2",43,"A2",37,"C2",41,"A2",19,"A2",54,"B2",235,32,"B2",37,"B1",35,"C2",37,"B1",27,"C1",65,"B1",233]
[9534,"RITYA",39,"B1",28,"C1",65,"B1",32,"B2",39,"B1",53,"B2",256,37,"B1",43,"A2",65,"B1",42,"A2",33,"B2",76,"A2",296,41,"A2",20,"D1",34,"C2",41,"A2",38,"B1",76,"A2",288,24,"C2",42,"A2",65,"B1",33,"B2",33,"A2",47,"C1",244,39,"B1",39,"B1",42,"C1",12,"D2",29,"B1",76,"A2",237,33,"B2",33,"B2",76,"A2",33,"B2",45,"A2",53,"B2",273]
[9535,"GAURI",35,"B2",28,"C1",75,"A2",33,"B2",20,"D1",76,"A2",267,29,"C1",39,"B1",66,"B1",45,"A2",46,"A1",35,"C2",260,24,"C2",48,"A1",38,"C2",22,"C2",29,"C1",54,"B2",289,42,"A2",43,"A2",85,"A1",39,"B1",46,"A2",59,"B2",314,38,"B1",29,"C1",33,"C2",12,"D2",28,"C1",54,"B2",194,42,"A2",46,"A1",87,"A1",46,"A1",39,"B1",76,"A2",336]
[9536,"ADITI",23,"C2",36,"B1",76,"A2",42,"A2",48,"A1",76,"A2",301,40,"B1",29,"C1",65,"B1",23,"C2",49,"A1",76,"A2",282,42,"A2",39,"B1",29,"D1",30,"C1",38,"B1",76,"A2",290,34,"B2",39,"B1",26,"D1",38,"B1",49,"B1",69,"B1",255,28,"C1",20,"D1",37,"C2",34,"B2",33,"D1",65,"B1",217,43,"A2",49,"A1",54,"B2",49,"A1",37,"B1",76,"A2",308]
[9537,"CHANCHAL BHOWRA ",35,"B2",35,"B2",67,"B1",43,"A2",39,"B1",26,"D1",245,41,"A2",20,"D1",65,"B1",34,"B2",38,"B1",87,"A1",285,34,"B2",40,"B1",38,"C2",25,"C2",41,"A2",54,"B2",291,43,"A2",29,"C1",56,"B2",32,"B2",38,"C1",75,"A2",273,29,"C1",38,"B1",37,"C2",38,"B1",42,"B1",76,"A2",260,39,{"$f":"IF(BP46>45,\"A1\",IF(BP46>40,\"A2\",IF(BP46>35,\"B1\",IF(BP46>30,\"B2\",IF(BP46>25,\"C1\",IF(BP46>20,\"C2\",IF(BP46>15,\"D1\",IF(BP46>10,\"D2\",IF(BP46>5,\"E1\",IF(BP46>0,\"E2\"))))))))))","v":"B1"},38,"B1",76,"A2",38,"B1",37,{"$f":"IF(BX46>45,\"A1\",IF(BX46>40,\"A2\",IF(BX46>35,\"B1\",IF(BX46>30,\"B2\",IF(BX46>25,\"C1\",IF(BX46>20,\"C2\",IF(BX46>15,\"D1\",IF(BX46>10,\"D2\",IF(BX46>5,\"E1\",IF(BX46>0,\"E2\"))))))))))","v":"B1"},33,"C2",261]
[9538,"SONAL",28,"C1",37,"B1",74,"A2",39,"B1",40,"B1",56,"B2",274,37,"B1",38,"B1",87,"A1",30,"C1",37,"B1",54,"B2",283,43,"A2",43,"A2",41,"C1",35,"B2",39,"B1",65,"B1",292,34,"B2",20,"D1",84,"A1",39,"B1",37,"D1",74,"A2",288,39,{"$f":"IF(BC47>45,\"A1\",IF(BC47>40,\"A2\",IF(BC47>35,\"B1\",IF(BC47>30,\"B2\",IF(BC47>25,\"C1\",IF(BC47>20,\"C2\",IF(BC47>15,\"D1\",IF(BC47>10,\"D2\",IF(BC47>5,\"E1\",IF(BC47>0,\"E2\"))))))))))","v":"B1"},37,"B1",39,"C2",29,"C1",38,{"$f":"IF(BE47>45,\"A1\",IF(BE47>40,\"A2\",IF(BE47>35,\"B1\",IF(BE47>30,\"B2\",IF(BE47>25,\"C1\",IF(BE47>20,\"C2\",IF(BE47>15,\"D1\",IF(BE47>10,\"D2\",IF(BE47>5,\"E1\",IF(BE47>0,\"E2\"))))))))))","v":"B1"},45,"C1",227,29,"C1",37,"B1",54,"B2",37,"B1",39,"B1",22,"D1",218]
[9539,"TANYA GUPTA",40,"B1",42,"A2",84,"A1",29,"C1",43,"A2",84,"A1",322,39,"B1",37,"B1",76,"A2",41,"A2",38,"B1",76,"A2",307,34,"B2",48,"A1",39,"C2",28,"C1",38,"B1",76,"A2",293,39,"B1",38,"B1",75,"A2",29,"C1",38,"B1",28,"D1",247,29,"C1",33,"B2",46,"C1",38,"B1",36,"B2",45,"C1",227,20,"D1",38,"B1",76,"A2",38,"B1",20,"D1",30,"D1",222]
[9540,"AKANSHA",33,"B2",33,"B2",76,"A2",20,"D1",48,"A1",75,"A2",285,32,"B2",33,"B2",55,"B2",12,"D2",27,"C1",54,"B2",213,39,"B1",29,"C1",38,"C2",40,"B1",28,"C1",54,"B2",294,29,"C1",37,"B1",47,"C1",20,"D1",27,"B1",23,"D1",183,38,"B1",46,"A1",49,"C1",41,"A2",29,"A1",76,"A2",279,38,"B1",27,"C1",54,"B2",27,"C1",48,"A1",25,"D1",219]
[9541,"KARISHMA",39,"B1",37,"B1",85,"A1",38,"B1",29,"C1",47,"C1",275,37,"B1",46,"A1",77,"A2",12,"D2",47,"A1",76,"A2",295,29,"C1",38,"B1",86,"A1",33,"B2",29,"C1",67,"B1",295,42,"A2",33,"B2",37,"C2",38,"B1",47,"B2",45,"C1",242,22,"C2",49,"A1",28,"D1",39,"B1",31,"A1",76,"A2",245,37,"B1",47,"A1",65,"B1",47,"A1",42,"A2",64,"B1",302]
[9542,"ALFISHA",38,"B1",37,"B1",73,"A2",37,"B1",38,"B1",37,"C2",260,38,"B1",49,"A1",76,"A2",34,"B2",39,"B1",54,"B2",290,42,"A2",41,"A2",64,"B1",39,"B1",39,"B1",81,"A1",296,41,"A2",46,"A1",36,"C2",37,"B1",39,"A1",39,"C2",238,33,"B2",38,"B1",39,"C2",38,"B1",36,"B1",55,"B2",239,33,"B2",39,"B1",76,"A2",39,"B1",38,"B1",67,"B1",292]
[9543,"KHUSHI",32,"B2",39,"B1",86,"A1",33,"B2",41,"A2",36,"C2",267,20,"D1",38,"B1",54,"B2",38,"B1",42,"A2",65,"B1",257,45,"A2",24,"C2",67,"B1",38,"B1",29,"C1",65,"B1",297,39,"B1",49,"A1",46,"C1",33,"B2",24,"A1",27,"D1",218,22,"C2",37,"B1",39,"C2",28,"C1",28,"B1",86,"A1",240,46,"A1",24,"C2",45,"C1",47,"A1",36,"B1",76,"A2",274]
[9544,"ANKITA",43,"A2",46,"A1",88,"A1",46,"A1",24,"C2",46,"C1",293,39,"B1",37,"B1",76,"A2",29,"C1",34,"B2",76,"A2",291,23,"C2",42,"A2",76,"A2",32,"B2",38,"B1",76,"A2",298,38,"B1",38,"B1",57,"B2",46,"A1",23,"B1",45,"C1",247,28,"C1",38,"B1",29,"D1",29,"C1",43,"B1",65,"B1",232,49,"A1",38,"B1",45,"C1",39,"B1",29,"C1",35,"C2",235]
[9545,"KAREENA",44,"A2",49,"A1",86,"A1",49,"A1",42,"A2",57,"B2",327,28,"C1",38,"B1",43,"C1",38,"B1",43,"A2",45,"C1",235,34,"B2",34,"B2",35,"C2",43,"A2",22,"C2",64,"B1",299,28,"C1",37,"B1",36,"C2",49,"A1",25,"B1",39,"C2",214,29,"C1",27,"C1",20,"D2",39,"B1",35,"C1",53,"B2",203,38,"B1",34,"B2",76,"A2",29,"C1",31,"B2",76,"A2",284]
[9546,"GARIMA",29,"C1",28,"C1",75,"A2",38,"B1",34,"B2",36,"C2",240,38,"B1",27,"C1",65,"B1",41,"A2",34,"B2",45,"C1",250,30,"C1",43,"A2",76,"A2",44,"A2",33,"B2",56,"B2",300,29,"C1",38,"B1",76,"A2",38,"B1",34,"B1",37,"C2",252,39,"B1",47,"A1",28,"D1",28,"C1",31,"A1",76,"A2",249,37,"B1",38,{"$f":"IF(BR57>45,\"A1\",IF(BR57>40,\"A2\",IF(BR57>35,\"B1\",IF(BR57>30,\"B2\",IF(BR57>25,\"C1\",IF(BR57>20,\"C2\",IF(BR57>15,\"D1\",IF(BR57>10,\"D2\",IF(BR57>5,\"E1\",IF(BR57>0,\"E2\"))))))))))","v":"B1"},76,"A2",20,"D1",36,"B1",87,"A1",{"$f":"SUM(BP55,BR57,BT55,BV55,BX55,BZ55)","v":294}]
[9547,"JHALAK",20,"D1",39,"B1",46,"C1",37,"B1",43,"A2",76,"A2",261,47,"A1",47,"A1",34,"C2",39,"B1",39,"B1",76,"A2",282,41,"A2",34,"B2",87,"A1",43,"A2",22,"C2",76,"A2",301,39,"B1",27,"C1",64,"B1",37,"B1",30,"C1",37,"C2",234,29,"C1",39,"B1",28,"D1",29,"C1",28,"B1",76,"A2",229,38,"B1",37,{"$f":"IF(BR58>45,\"A1\",IF(BR58>40,\"A2\",IF(BR58>35,\"B1\",IF(BR58>30,\"B2\",IF(BR58>25,\"C1\",IF(BR58>20,\"C2\",IF(BR58>15,\"D1\",IF(BR58>10,\"D2\",IF(BR58>5,\"E1\",IF(BR58>0,\"E2\"))))))))))","v":"B1"},55,"B2",28,"C1",28,"C1",54,"B2",{"$f":"SUM(BP56,BR58,BT56,BV56,BX56,BZ56)","v":240}]
[9548,"ANJALI",28,"C1",39,"B1",49,"C1",38,"B1",34,"B2",64,"B1",252,37,"B1",39,"B1",65,"B1",38,"B1",29,"C1",76,"A2",284,12,"D2",39,"B1",54,"B2",48,"A1",33,"B2",87,"A1",302,29,"C1",47,"A1",75,"A2",39,"B1",41,"A1",39,"C2",270,38,"B1",42,"A2",20,"D2",39,"B1",38,"A2",39,"C2",216,27,"C1",38,{"$f":"IF(BR59>45,\"A1\",IF(BR59>40,\"A2\",IF(BR59>35,\"B1\",IF(BR59>30,\"B2\",IF(BR59>25,\"C1\",IF(BR59>20,\"C2\",IF(BR59>15,\"D1\",IF(BR59>10,\"D2\",IF(BR59>5,\"E1\",IF(BR59>0,\"E2\"))))))))))","v":"B1"},76,"A2",28,"C1",43,"A2",76,"A2",{"$f":"SUM(BP57,BR59,BT57,BV57,BX57,BZ57)","v":288}]
[9549,"NIDHI",37,"B1",29,"C1",47,"C1",27,"C1",39,"B1",75,"A2",254,28,"C1",35,"B2",86,"A1",28,"C1",42,"A2",55,"B2",274,12,"D2",29,"C1",76,"A2",29,"C1",39,"B1",54,"B2",303,38,"B1",39,"B1",63,"B1",38,"B1",12,"B1",20,"D2",210,22,"C2",38,"B1",19,"D2",29,"C1",14,"B1",28,"D1",150,47,"A1",37,{"$f":"IF(BR60>45,\"A1\",IF(BR60>40,\"A2\",IF(BR60>35,\"B1\",IF(BR60>30,\"B2\",IF(BR60>25,\"C1\",IF(BR60>20,\"C2\",IF(BR60>15,\"D1\",IF(BR60>10,\"D2\",IF(BR60>5,\"E1\",IF(BR60>0,\"E2\"))))))))))","v":"C1"},76,"A2",20,"D1",35,"B2",54,"B2",{"$f":"SUM(BP58,BR60,BT58,BV58,BX58,BZ58)","v":259}]
[9550,"NAMRATA",34,"B2",20,"D1",68,"B1",47,"A1",29,"C1",63,"B1",261,28,"C1",42,"A2",65,"B1",29,"C1",38,"B1",76,"A2",278,34,"B2",42,"A2",54,"B2",38,"B1",38,"B1",86,"A1",304,22,"C2",38,"B1",76,"A2",37,"B1",12,"B1",48,"C1",233,33,"B2",36,"B1",29,"D1",38,"B1",39,"B1",38,"C2",213,39,"B1",38,{"$f":"IF(BR61>45,\"A1\",IF(BR61>40,\"A2\",IF(BR61>35,\"B1\",IF(BR61>30,\"B2\",IF(BR61>25,\"C1\",IF(BR61>20,\"C2\",IF(BR61>15,\"D1\",IF(BR61>10,\"D2\",IF(BR61>5,\"E1\",IF(BR61>0,\"E2\"))))))))))","v":"A1"},65,"B1",19,"D1",31,"B2",76,"A2",{"$f":"SUM(BP59,BR61,BT59,BV59,BX59,BZ59)","v":277}]
[9551,"DIVYA TYAGI",36,"B1",28,"C1",69,"B1",39,"B1",42,"A2",76,"A2",290,36,"B1",38,"B1",65,"B1",39,"B1",36,"B1",76,"A2",290,38,"B1",34,"B2",76,"A2",41,"A2",32,"B2",64,"B1",305,33,"B2",37,"B1",85,"A1",33,"B2",34,"B1",39,"C2",261,22,"C2",29,"C1",28,"D1",22,"C2",28,"C1",47,"C1",176,33,"B2",27,{"$f":"IF(BR62>45,\"A1\",IF(BR62>40,\"A2\",IF(BR62>35,\"B1\",IF(BR62>30,\"B2\",IF(BR62>25,\"C1\",IF(BR62>20,\"C2\",IF(BR62>15,\"D1\",IF(BR62>10,\"D2\",IF(BR62>5,\"E1\",IF(BR62>0,\"E2\"))))))))))","v":"B1"},66,"B1",29,"C1",28,"C1",54,"B2",{"$f":"SUM(BP60,BR62,BT60,BV60,BX60,BZ60)","v":249}]
[9552,"PARUL",38,"B1",28,"C1",70,"B1",38,"B1",38,"B1",85,"A1",297,35,"B2",39,"B1",76,"A2",29,"C1",29,"C1",65,"B1",273,29,"C1",30,"C1",54,"B2",24,"C2",43,"A2",67,"B1",306,22,"C2",33,"B2",63,"B1",46,"A1",38,"B2",40,"C2",242,30,"C1",31,"B2",33,"C2",33,"B2",24,"B2",37,"C2",188,46,"A1",47,{"$f":"IF(BR63>45,\"A1\",IF(BR63>40,\"A2\",IF(BR63>35,\"B1\",IF(BR63>30,\"B2\",IF(BR63>25,\"C1\",IF(BR63>20,\"C2\",IF(BR63>15,\"D1\",IF(BR63>10,\"D2\",IF(BR63>5,\"E1\",IF(BR63>0,\"E2\"))))))))))","v":"C2"},65,"B1",28,"C1",29,"C1",65,"B1",{"$f":"SUM(BP61,BR63,BT61,BV61,BX61,BZ61)","v":257}]
[9553,"MUSKAN",29,"C1",20,"D1",68,"B1",35,"B2",36,"B1",63,"B1",251,37,"B1",20,"D1",87,"A1",29,"C1",31,"B2",66,"B1",270,38,"B1",41,"A2",65,"B1",44,"A2",44,"A2",76,"A2",307,30,"C1",46,"A1",56,"B2",38,"B1",29,"A1",43,"C1",242,25,"C2",36,"B1",76,"A2",22,"C2",38,"B1",65,"B1",262,49,"A1",39,{"$f":"IF(BR64>45,\"A1\",IF(BR64>40,\"A2\",IF(BR64>35,\"B1\",IF(BR64>30,\"B2\",IF(BR64>25,\"C1\",IF(BR64>20,\"C2\",IF(BR64>15,\"D1\",IF(BR64>10,\"D2\",IF(BR64>5,\"E1\",IF(BR64>0,\"E2\"))))))))))","v":"B1"},65,"B1",33,"B2",20,"D1",76,"A2",{"$f":"SUM(BP62,BR64,BT62,BV62,BX62,BZ62)","v":281}]
[9554,"SHRUTI",39,"B1",19,"D1",75,"A2",45,"A2",29,"C1",56,"B2",263,42,"A2",38,"B1",65,"B1",43,"A2",36,"B1",65,"B1",289,34,"B2",12,"D2",76,"A2",43,"A2",29,"C1",35,"C2",308,25,"C2",38,"B1",75,"A2",27,"C1",38,"B1",48,"C1",251,35,"B2",28,"C1",87,"A1",30,"C1",34,"C1",76,"A2",290,38,"B1",24,{"$f":"IF(BR65>45,\"A1\",IF(BR65>40,\"A2\",IF(BR65>35,\"B1\",IF(BR65>30,\"B2\",IF(BR65>25,\"C1\",IF(BR65>20,\"C2\",IF(BR65>15,\"D1\",IF(BR65>10,\"D2\",IF(BR65>5,\"E1\",IF(BR65>0,\"E2\"))))))))))","v":"B2"},87,"A1",28,"C1",28,"C1",53,"B2",{"$f":"SUM(BP63,BR65,BT63,BV63,BX63,BZ63)","v":268}]
[9555,"SHAHROJ",null,false,29,"C1",64,"B1",3,"E2",31,"B2",75,"A2",202,27,"C1",27,"C1",54,"B2",34,"B2",28,"C1",65,"B1",235,39,"B1",12,"D2",86,"A1",48,"A1",39,"B1",76,"A2",309,32,"B2",27,"C1",67,"B1",38,"B1",33,"C1",82,"A1",279,28,"C1",43,"A2",54,"B2",25,"C2",43,"A2",45,"C1",238,37,"B1",38,{"$f":"IF(#REF!>45,\"A1\",IF(#REF!>40,\"A2\",IF(#REF!>35,\"B1\",IF(#REF!>30,\"B2\",IF(#REF!>25,\"C1\",IF(#REF!>20,\"C2\",IF(#REF!>15,\"D1\",IF(#REF!>10,\"D2\",IF(#REF!>5,\"E1\",IF(#REF!>0,\"E2\"))))))))))","v":{"$error":"#REF!"}},76,"A2",28,"C1",28,"C1",76,"A2",{"$f":"SUM(BP64,#REF!,BT64,BV64,BX64,BZ64)","v":{"$error":"#REF!"}}]
[9556,"TWINKLE",38,"B1",28,"C1",76,"A2",45,"A2",36,"B1",67,"B1",290,47,"A1",44,"A2",54,"B2",39,"B1",34,"B2",87,"A1",305,29,"C1",34,"B2",64,"B1",29,"C1",28,"C1",87,"A1",310,33,"B2",47,"A1",46,"C1",38,"B1",46,"A1",75,"A2",285,40,"B1",35,"B2",76,"A2",35,"B2",23,"B2",45,"C1",254,38,"B1",34,{"$f":"IF(#REF!>45,\"A1\",IF(#REF!>40,\"A2\",IF(#REF!>35,\"B1\",IF(#REF!>30,\"B2\",IF(#REF!>25,\"C1\",IF(#REF!>20,\"C2\",IF(#REF!>15,\"D1\",IF(#REF!>10,\"D2\",IF(#REF!>5,\"E1\",IF(#REF!>0,\"E2\"))))))))))","v":{"$error":"#REF!"}},54,"B2",20,"D1",20,"D1",76,"A2",{"$f":"SUM(BP65,#REF!,BT65,BV65,BX65,BZ65)","v":{"$error":"#REF!"}}]
[9557,"SAKSHI",34,"B2",33,"B2",78,"A2",27,"C1",28,"C1",46,"C1",246,39,"B1",34,{"$f":"IF(R66>45,\"A1\",IF(R66>40,\"A2\",IF(R66>35,\"B1\",IF(R66>30,\"B2\",IF(R66>25,\"C1\",IF(R66>20,\"C2\",IF(R66>15,\"D1\",IF(R66>10,\"D2\",IF(R66>5,\"E1\",IF(R66>0,\"E2\"))))))))))","v":"B2"},67,"B1",29,{"$f":"IF(V66>45,\"A1\",IF(V66>40,\"A2\",IF(V66>35,\"B1\",IF(V66>30,\"B2\",IF(V66>25,\"C1\",IF(V66>20,\"C2\",IF(V66>15,\"D1\",IF(V66>10,\"D2\",IF(V66>5,\"E1\",IF(V66>0,\"E2\"))))))))))","v":"C1"},44,"A2",76,"A2",289,42,"A2",32,"B2",67,"B1",38,{"$f":"IF(AI66>45,\"A1\",IF(AI66>40,\"A2\",IF(AI66>35,\"B1\",IF(AI66>30,\"B2\",IF(AI66>25,\"C1\",IF(AI66>20,\"C2\",IF(AI66>15,\"D1\",IF(AI66>10,\"D2\",IF(AI66>5,\"E1\",IF(AI66>0,\"E2\"))))))))))","v":"B1"},45,"A2",64,"B1",311,42,"A2",44,{"$f":"IF(AR66>45,\"A1\",IF(AR66>40,\"A2\",IF(AR66>35,\"B1\",IF(AR66>30,\"B2\",IF(AR66>25,\"C1\",IF(AR66>20,\"C2\",IF(AR66>15,\"D1\",IF(AR66>10,\"D2\",IF(AR66>5,\"E1\",IF(AR66>0,\"E2\"))))))))))","v":"A2"},47,"C1",38,{"$f":"IF(AV66>45,\"A1\",IF(AV66>40,\"A2\",IF(AV66>35,\"B1\",IF(AV66>30,\"B2\",IF(AV66>25,\"C1\",IF(AV66>20,\"C2\",IF(AV66>15,\"D1\",IF(AV66>10,\"D2\",IF(AV66>5,\"E1\",IF(AV66>0,\"E2\"))))))))))","v":"B1"},38,"A2",73,"A2",282,33,"B2",31,"B2",54,"B2",43,"A2",34,"B2",76,"A2",271,27,"C1",44,{"$f":"IF(BR66>45,\"A1\",IF(BR66>40,\"A2\",IF(BR66>35,\"B1\",IF(BR66>30,\"B2\",IF(BR66>25,\"C1\",IF(BR66>20,\"C2\",IF(BR66>15,\"D1\",IF(BR66>10,\"D2\",IF(BR66>5,\"E1\",IF(BR66>0,\"E2\"))))))))))","v":"A2"},76,"A2",19,{"$f":"IF(BV66>45,\"A1\",IF(BV66>40,\"A2\",IF(BV66>35,\"B1\",IF(BV66>30,\"B2\",IF(BV66>25,\"C1\",IF(BV66>20,\"C2\",IF(BV66>15,\"D1\",IF(BV66>10,\"D2\",IF(BV66>5,\"E1\",IF(BV66>0,\"E2\"))))))))))","v":"D1"},46,{"$f":"IF(BX66>45,\"A1\",IF(BX66>40,\"A2\",IF(BX66>35,\"B1\",IF(BX66>30,\"B2\",IF(BX66>25,\"C1\",IF(BX66>20,\"C2\",IF(BX66>15,\"D1\",IF(BX66>10,\"D2\",IF(BX66>5,\"E1\",IF(BX66>0,\"E2\"))))))))))","v":"A1"},39,"C2",251]
[null,null,null,null,null,null,null,null,null,null,null,null,null,null,null,null,null,null,null,null,null,null,null,null,null,null,null,null,null,null,null,null,null,null,null,null,null,null,null,null,null,null,null,null,59,null,null,null,null,null,null,null,39,null,null,null,null,null,null,null,null,null,null,null,null,null,null,null,null,null,54]
[null,null,null,null,null,null,null,null,null,null,null,null,null,null,null,null,null,null,null,null,null,null,null,null,null,null,null,null,null,null,null,null,null,null,null,null,null,null,null,null,null,null,null,null,null,69,null,null,null,null,null,null,null,null,null,null,null,null,null,null,null,null,null,null,null,null,null,null,null,null,null,65]
[null,null,null,null,null,null,null,null,null,null,null,null,null,null,null,null,null,null,null,null,null,null,null,null,null,null,null,null,null,null,null,null,null,null,null,null,null,null,null,null,null,null,null,null,null,75,null,null,null,null,null,null,null,null,32]
[null,null,null,null,null,null,null,null,null,null,null,null,null,null,null,null,null,null,null,null,null,null,null,null,null,null,null,null,null,null,null,null,null,null,null,null,null,null,null,null,null,null,null,null,null,74,null,null,null,null,null,null,null,null,43]
[null,null,null,null,null,null,null,null,null,null,null,null,null,null,null,null,null,null,null,null,null,null,null,null,null,null,null,null,null,null,null,null,null,null,null,null,null,null,null,null,null,null,null,null,null,null,null,null,null,null,null,null,null,null,44]